Reaction Details
TargetRibonucleoside-diphosphate reductase large subunit/subunit M2
LigandBDBM50053963
Substrate/Competitorn/a
Meas. Tech.ChEMBL_195256 (CHEMBL872978)
IC50 27±n/a nM
Citation Moss, NBeaulieu, PDuceppe, JSFerland, JMGarneau, MGauthier, JGhiro, EGoulet, SGuse, IJaramillo, JLlinas-Brunet, MMalenfant, EPlante, RPoirier, MSoucy, FWernic, DYoakim, CDéziel, R Peptidomimetic inhibitors of herpes simplex virus ribonucleotide reductase with improved in vivo antiviral activity. J Med Chem39:4173-80 (1996) 
 
Ribonucleoside-diphosphate reductase large subunit/subunit M2
Name:Ribonucleoside-diphosphate reductase large subunit/subunit M2
Type:Enzyme
Mol. Mass.:n/a
Description:n/a
Components:This complex has 2 components.
Component 1
Name:Ribonucleoside-diphosphate reductase large subunit
Synonyms:RIR1_HUMAN RRM1 Ribonucleoside-diphosphate reductase subunit M1 | Ribonucleotide reductase large subunit
Type:PROTEIN
Mol. Mass.:90074.67
Organism:Homo sapiens (Human)
Description:ChEMBL_90946
Residue:792
Component 2
Name:Ribonucleoside-diphosphate reductase subunit M2
Synonyms:RIR2_HUMAN RRM2 Ribonucleotide reductase small chain | Ribonucleotide reductase small subunit
Type:PROTEIN
Mol. Mass.:44868.59
Organism:Homo sapiens (Human)
Description:ChEMBL_195255
Residue:389
BDBM50053963
NameBDBM50053963
Synonyms:(S)-3-((S)-2-{(S)-2-[3-(1-Ethyl-propyl)-ureido]-3,3-dimethyl-butyrylamino}-4-oxo-4-pyrrolidin-1-yl-butyrylamino)-N-((R)-1,2,2-trimethyl-propyl)-succinamic acid | CHEMBL131682
TypeSmall organic molecule
Emp. Form.C30H54N6O7
Mol. Mass.610.7858
SMILESCCC(CC)NC(=O)N[C@H](C(=O)N[C@@H](CC(=O)N1CCCC1)C(=O)N[C@@H](CC(O)=O)C(=O)N[C@H](C)C(C)(C)C)C(C)(C)C