Reaction Details
TargetRibonucleoside-diphosphate reductase large subunit/subunit M2
LigandBDBM50053981
Substrate/Competitorn/a
Meas. Tech.ChEMBL_195256 (CHEMBL872978)
IC50 5±n/a nM
Citation Moss, NBeaulieu, PDuceppe, JSFerland, JMGarneau, MGauthier, JGhiro, EGoulet, SGuse, IJaramillo, JLlinas-Brunet, MMalenfant, EPlante, RPoirier, MSoucy, FWernic, DYoakim, CDéziel, R Peptidomimetic inhibitors of herpes simplex virus ribonucleotide reductase with improved in vivo antiviral activity. J Med Chem39:4173-80 (1996) 
 
Ribonucleoside-diphosphate reductase large subunit/subunit M2
Name:Ribonucleoside-diphosphate reductase large subunit/subunit M2
Type:Enzyme
Mol. Mass.:n/a
Description:n/a
Components:This complex has 2 components.
Component 1
Name:Ribonucleoside-diphosphate reductase large subunit
Synonyms:RIR1_HUMAN RRM1 Ribonucleoside-diphosphate reductase subunit M1 | Ribonucleotide reductase large subunit
Type:PROTEIN
Mol. Mass.:90074.67
Organism:Homo sapiens (Human)
Description:ChEMBL_90946
Residue:792
Component 2
Name:Ribonucleoside-diphosphate reductase subunit M2
Synonyms:RIR2_HUMAN RRM2 Ribonucleotide reductase small chain | Ribonucleotide reductase small subunit
Type:PROTEIN
Mol. Mass.:44868.59
Organism:Homo sapiens (Human)
Description:ChEMBL_195255
Residue:389
BDBM50053981
NameBDBM50053981
Synonyms:(S)-2-((S)-3-Carboxy-2-{(2R,5S)-2-(3,3-dimethyl-2-oxo-butyl)-5-[3-(1-ethyl-propyl)-ureido]-6,6-dimethyl-4-oxo-heptanoylamino}-propionylamino)-4-methyl-pentanoic acid | CHEMBL335164
TypeSmall organic molecule
Emp. Form.C31H54N4O9
Mol. Mass.626.7819
SMILESCCC(CC)NC(=O)N[C@H](C(=O)C[C@@H](CC(=O)C(C)(C)C)C(=O)N[C@@H](CC(O)=O)C(=O)N[C@@H](CC(C)C)C(O)=O)C(C)(C)C