Reaction Details
TargetMacrophage migration inhibitory factor
LigandBDBM50095994
Substrate/Competitorn/a
Meas. Tech.ChEMBL_103899 (CHEMBL711481)
Ki 2900±n/a nM
Citation Orita, MYamamoto, SKatayama, NAoki, MTakayama, KYamagiwa, YSeki, NSuzuki, HKurihara, HSakashita, HTakeuchi, MFujita, SYamada, TTanaka, A Coumarin and chromen-4-one analogues as tautomerase inhibitors of macrophage migration inhibitory factor: discovery and X-ray crystallography. J Med Chem44:540-7 (2001) Macrophage migration inhibitory factor
Name:Macrophage migration inhibitory factor
Type:Enzyme
Mol. Mass.:12478.18
Organism:Homo sapiens (Human)
Description:P14174
Residue:115
BDBM50095994
NameBDBM50095994
Synonyms:3-Cyano-7-hydroxycoumarin (2) CHEMBL150302
TypeSmall organic molecule
Emp. Form.C10H5NO3
Mol. Mass.187.1516
SMILESOc1ccc2cc(C#N)c(=O)oc2c1