Reaction Details
TargetMacrophage migration inhibitory factor
LigandBDBM50096009
Substrate/Competitorn/a
Meas. Tech.ChEMBL_103899 (CHEMBL711481)
Ki 6200±n/a nM
Citation Orita, MYamamoto, SKatayama, NAoki, MTakayama, KYamagiwa, YSeki, NSuzuki, HKurihara, HSakashita, HTakeuchi, MFujita, SYamada, TTanaka, A Coumarin and chromen-4-one analogues as tautomerase inhibitors of macrophage migration inhibitory factor: discovery and X-ray crystallography. J Med Chem44:540-7 (2001) Macrophage migration inhibitory factor
Name:Macrophage migration inhibitory factor
Type:Enzyme
Mol. Mass.:12478.18
Organism:Homo sapiens (Human)
Description:P14174
Residue:115
BDBM50096009
NameBDBM50096009
Synonyms:3-(4-Dimethylamino-benzylidene)-chroman-2,4-dione | CHEMBL153002
TypeSmall organic molecule
Emp. Form.C18H15NO3
Mol. Mass.293.3166
SMILESCN(C)c1ccc(\C=C2/C(=O)Oc3ccccc3C2=O)cc1