Reaction Details
TargetMu-type opioid receptor
LigandBDBM50116621
Substrate/Competitorn/a
Meas. Tech.ChEMBL_148836 (CHEMBL753954)
Ki 3.3±n/a nM
Citation Thomas, JBAtkinson, RNNamdev, NRothman, RBGigstad, KMFix, SEMascarella, SWBurgess, JPVinson, NAXu, HDersch, CMCantrell, BEZimmerman, DMCarroll, FI Discovery of an opioid kappa receptor selective pure antagonist from a library of N-substituted 4beta-methyl-5-(3-hydroxyphenyl)morphans. J Med Chem45:3524-30 (2002) Mu-type opioid receptor
Name:Mu-type opioid receptor
Type:G Protein-Coupled Receptor (GPCR)
Mol. Mass.:44503.11
Organism:Rattus norvegicus (rat)
Description:Competition binding assays were carried out using membrane preparations from transfected HN9.10 cells that constitutively expressed the mu opioid receptor.
Residue:398
BDBM50116621
NameBDBM50116621
Synonyms:3-[7-Amino-4-methyl-2-(3-phenyl-propyl)-2-aza-bicyclo[3.3.1]non-5-yl]-phenol | CHEMBL333342
TypeSmall organic molecule
Emp. Form.C24H32N2O
Mol. Mass.364.5237
SMILESCC1CN(CCCc2ccccc2)C2C[C@H](N)CC1(C2)c1cccc(O)c1