Reaction Details
TargetHistamine H3 receptor
LigandBDBM22888
Substrate/Competitorn/a
Meas. Tech.ChEMBL_83644 (CHEMBL693106)
Ki 84±n/a nM
Citation Jablonowski, JAGrice, CAChai, WDvorak, CAVenable, JDKwok, AKLy, KSWei, JBaker, SMDesai, PJJiang, WWilson, SJThurmond, RLKarlsson, LEdwards, JPLovenberg, TWCarruthers, NI The first potent and selective non-imidazole human histamine H4 receptor antagonists. J Med Chem46:3957-60 (2003) 
 
Histamine H3 receptor
Name:Histamine H3 receptor
Type:G Protein-Coupled Receptor (GPCR)
Mol. Mass.:48691.47
Organism:Homo sapiens (Human)
Description:Binding assays were using CHO cells stably expressing hH3R receptors.
Residue:445
BDBM22888
NameBDBM22888
Synonyms:1-[4-(1H-imidazol-5-yl)butyl]-3-methylthiourea CHEMBL12160
TypeSmall organic molecule
Emp. Form.C9H16N4S
Mol. Mass.212.315
SMILESCNC(=S)NCCCCc1cnc[nH]1