Reaction Details
TargetHistamine H3 receptor
LigandBDBM22904
Substrate/Competitorn/a
Meas. Tech.ChEMBL_83644 (CHEMBL693106)
Ki 0.7±n/a nM
Citation Jablonowski, JAGrice, CAChai, WDvorak, CAVenable, JDKwok, AKLy, KSWei, JBaker, SMDesai, PJJiang, WWilson, SJThurmond, RLKarlsson, LEdwards, JPLovenberg, TWCarruthers, NI The first potent and selective non-imidazole human histamine H4 receptor antagonists. J Med Chem46:3957-60 (2003) 
 
Histamine H3 receptor
Name:Histamine H3 receptor
Type:G Protein-Coupled Receptor (GPCR)
Mol. Mass.:48691.47
Organism:Homo sapiens (Human)
Description:Binding assays were using CHO cells stably expressing hH3R receptors.
Residue:445
BDBM22904
NameBDBM22904
Synonyms:(2R)-1-(1H-imidazol-5-yl)propan-2-amine Alpha-Methylhistamine-R CHEMBL268229 RAMH
TypeSmall organic molecule
Emp. Form.C6H11N3
Mol. Mass.125.1716
SMILESC[C@@H](N)Cc1cnc[nH]1