Reaction Details
TargetHistamine H4 receptor
LigandBDBM50133020
Substrate/Competitorn/a
Meas. Tech.ChEMBL_87092 (CHEMBL700770)
Ki 17±n/a nM
Citation Jablonowski, JAGrice, CAChai, WDvorak, CAVenable, JDKwok, AKLy, KSWei, JBaker, SMDesai, PJJiang, WWilson, SJThurmond, RLKarlsson, LEdwards, JPLovenberg, TWCarruthers, NI The first potent and selective non-imidazole human histamine H4 receptor antagonists. J Med Chem46:3957-60 (2003) 
 
Histamine H4 receptor
Name:Histamine H4 receptor
Type:G Protein-Coupled Receptor (GPCR)
Mol. Mass.:44517.02
Organism:Homo sapiens (Human)
Description:Binding assays were using CHO cells stably expressing hH4R receptors.
Residue:390
BDBM50133020
NameBDBM50133020
Synonyms:(1H-Indol-2-yl)-(4-methyl-piperazin-1-yl)-methanone CHEMBL129199 | JNJ-7777120
TypeSmall organic molecule
Emp. Form.C14H17N3O
Mol. Mass.243.3043
SMILESCN1CCN(CC1)C(=O)c1cc2ccccc2[nH]1