Reaction Details
TargetProstaglandin E2 receptor EP1 subtype
LigandBDBM50167892
Substrate/Competitorn/a
Meas. Tech.ChEMBL_303233 (CHEMBL827198)
Ki>1000±n/a nM
Citation Hattori, KTanaka, AOkitsu, OTabuchi, STaniguchi, KNishio, MKoyama, SHigaki, MSeki, JSakane, K Discovery of diphenylcarbamate derivatives as highly potent and selective IP receptor agonists: orally active prostacyclin mimetics. Part 3. Bioorg Med Chem Lett15:3091-5 (2005) 
 
Prostaglandin E2 receptor EP1 subtype
Name:Prostaglandin E2 receptor EP1 subtype
Type:Enzyme
Mol. Mass.:41834.57
Organism:Homo sapiens (Human)
Description:P34995
Residue:402
BDBM50167892
NameBDBM50167892
Synonyms:CHEMBL195456 | {(S)-6-[(Diphenylcarbamoyloxy)-methyl]-5,6-dihydroxy-5,6,7,8-tetrahydro-naphthalen-1-yloxy}-acetic acid
TypeSmall organic molecule
Emp. Form.C26H25NO7
Mol. Mass.463.4792
SMILESO[C@@H]1c2cccc(OCC(O)=O)c2CC[C@]1(O)COC(=O)N(c1ccccc1)c1ccccc1