Reaction Details
TargetProstaglandin E2 receptor EP2 subtype
LigandBDBM50167890
Substrate/Competitorn/a
Meas. Tech.ChEMBL_303234 (CHEMBL827199)
Ki>1000±n/a nM
Citation Hattori, KTanaka, AOkitsu, OTabuchi, STaniguchi, KNishio, MKoyama, SHigaki, MSeki, JSakane, K Discovery of diphenylcarbamate derivatives as highly potent and selective IP receptor agonists: orally active prostacyclin mimetics. Part 3. Bioorg Med Chem Lett15:3091-5 (2005) 
 
Prostaglandin E2 receptor EP2 subtype
Name:Prostaglandin E2 receptor EP2 subtype
Type:Enzyme
Mol. Mass.:39775.71
Organism:Homo sapiens (Human)
Description:P43116
Residue:358
BDBM50167890
NameBDBM50167890
Synonyms:CHEMBL190497 Sodium; {(R)-5-[(R)-2-(4,5-diphenyl-oxazol-2-yl)-pyrrolidin-1-yl]-5,6,7,8-tetrahydro-naphthalen-1-yloxy}-acetate
TypeSmall organic molecule
Emp. Form.C31H29N2O4
Mol. Mass.493.5735
SMILES[O-]C(=O)COc1cccc2[C@@H](CCCc12)N1CCC[C@@H]1c1nc(c(o1)-c1ccccc1)-c1ccccc1