Reaction Details
TargetGlucocorticoid receptor
LigandBDBM50222085
Substrate/Competitorn/a
Meas. Tech.ChEMBL_457751 (CHEMBL924028)
IC50 540±n/a nM
Citation Jin, CManikumar, GKepler, JACook, CEAllan, GFKiddoe, MBhattacharjee, SLinton, OLundeen, SGSui, Z Synthesis and identification of novel 11beta-aryl-4',5'-dihydrospiro[estra-4,9-diene-17beta,4'-oxazole] analogs with dissociated antiprogesterone activities. Bioorg Med Chem Lett17:5754-7 (2007) 
 
Glucocorticoid receptor
Name:Glucocorticoid receptor
Type:Enzyme
Mol. Mass.:85656.87
Organism:Homo sapiens (Human)
Description:P04150
Residue:777
BDBM50222085
NameBDBM50222085
Synonyms:(3S,10'S,11'S,15'S,17'R)-17'-[4-(dimethylamino)phenyl]-15'-methyl-2-methylidene-2H-spiro[1,4-oxazole-3,14'-tetracyclo[8.7.0.0^{2,7}.0^{11,15}]heptadecane]-1',6'-dien-5'-one | CHEMBL429114
TypeSmall organic molecule
Emp. Form.C29H34N2O2
Mol. Mass.442.5925
SMILESCN(C)c1ccc(cc1)[C@H]1C[C@@]2(C)[C@@H](CC[C@]22N=COC2=C)[C@@H]2CCC3=CC(=O)CCC3=C12