Reaction Details
TargetProgesterone receptor
LigandBDBM50222092
Substrate/Competitorn/a
Meas. Tech.ChEMBL_457750 (CHEMBL924027)
IC50 0.98±n/a nM
Citation Jin, CManikumar, GKepler, JACook, CEAllan, GFKiddoe, MBhattacharjee, SLinton, OLundeen, SGSui, Z Synthesis and identification of novel 11beta-aryl-4',5'-dihydrospiro[estra-4,9-diene-17beta,4'-oxazole] analogs with dissociated antiprogesterone activities. Bioorg Med Chem Lett17:5754-7 (2007) 
 
Progesterone receptor
Name:Progesterone receptor
Type:Protein
Mol. Mass.:98979.52
Organism:Homo sapiens (Human)
Description:P06401
Residue:933
BDBM50222092
NameBDBM50222092
Synonyms:(3S,10'S,11'S,15'S,17'R)-17'-[4-(dimethylamino)phenyl]-5-ethyl-15'-methyl-2-methylidene-2H-spiro[1,4-oxazole-3,14'-tetracyclo[8.7.0.0^{2,7}.0^{11,15}]heptadecane]-1',6'-dien-5'-one | CHEMBL250425
TypeSmall organic molecule
Emp. Form.C31H38N2O2
Mol. Mass.470.6456
SMILESCCC1=N[C@]2(CC[C@H]3[C@@H]4CCC5=CC(=O)CCC5=C4[C@H](C[C@]23C)c2ccc(cc2)N(C)C)C(=C)O1