Reaction Details
TargetReceptor tyrosine-protein kinase erbB-2
LigandBDBM50371359
Substrate/Competitorn/a
Meas. Tech.ChEMBL_463270 (CHEMBL930659)
IC50 19±n/a nM
Citation Barlaam, BBallard, PBradbury, RHDucray, RGermain, HHickinson, DMHudson, KKettle, JGKlinowska, TMagnien, FOgilvie, DJOlivier, APearson, SEScott, JSSuleman, ATrigwell, CBVautier, MWhittaker, RDWood, R A new series of neutral 5-substituted 4-anilinoquinazolines as potent, orally active inhibitors of erbB2 receptor tyrosine kinase. Bioorg Med Chem Lett18:674-8 (2008) 
 
Receptor tyrosine-protein kinase erbB-2
Name:Receptor tyrosine-protein kinase erbB-2
Type:n/a
Mol. Mass.:137894.47
Organism:Homo sapiens (Human)
Description:P04626
Residue:1255
BDBM50371359
NameBDBM50371359
Synonyms:CHEMBL403774
TypeSmall organic molecule
Emp. Form.C27H26ClN5O4
Mol. Mass.519.979
SMILESC[C@@H](Oc1cccc2ncnc(Nc3ccc(OCc4ccccn4)c(Cl)c3)c12)C(=O)N1CCOCC1