Reaction Details
TargetMacrophage colony-stimulating factor 1 receptor
LigandBDBM50371926
Substrate/Competitorn/a
Meas. Tech.ChEMBL_464342 (CHEMBL951197)
IC50 550±n/a nM
Citation Wall, MJChen, JMeegalla, SBallentine, SKWilson, KJDesJarlais, RLSchubert, CChaikin, MACrysler, CPetrounia, IPDonatelli, RRYurkow, EJBoczon, LMazzulla, MPlayer, MRPatch, RJManthey, CLMolloy, CTomczuk, BIllig, CR Synthesis and evaluation of novel 3,4,6-substituted 2-quinolones as FMS kinase inhibitors. Bioorg Med Chem Lett18:2097-102 (2008) 
 
Macrophage colony-stimulating factor 1 receptor
Name:Macrophage colony-stimulating factor 1 receptor
Type:Protein
Mol. Mass.:107979.48
Organism:Homo sapiens (Human)
Description:P07333
Residue:972
BDBM50371926
NameBDBM50371926
Synonyms:CHEMBL273011
TypeSmall organic molecule
Emp. Form.C20H14N4O
Mol. Mass.326.3514
SMILESCn1cnc(c1)-c1c(-c2ccccc2)c2cc(ccc2[nH]c1=O)C#N