Reaction Details
TargetMacrophage colony-stimulating factor 1 receptor
LigandBDBM50371940
Substrate/Competitorn/a
Meas. Tech.ChEMBL_464342 (CHEMBL951197)
IC50>5000±n/a nM
Citation Wall, MJChen, JMeegalla, SBallentine, SKWilson, KJDesJarlais, RLSchubert, CChaikin, MACrysler, CPetrounia, IPDonatelli, RRYurkow, EJBoczon, LMazzulla, MPlayer, MRPatch, RJManthey, CLMolloy, CTomczuk, BIllig, CR Synthesis and evaluation of novel 3,4,6-substituted 2-quinolones as FMS kinase inhibitors. Bioorg Med Chem Lett18:2097-102 (2008) 
 
Macrophage colony-stimulating factor 1 receptor
Name:Macrophage colony-stimulating factor 1 receptor
Type:Protein
Mol. Mass.:107979.48
Organism:Homo sapiens (Human)
Description:P07333
Residue:972
BDBM50371940
NameBDBM50371940
Synonyms:CHEMBL402635
TypeSmall organic molecule
Emp. Form.C19H14N2O2
Mol. Mass.302.3267
SMILESCc1cc(on1)-c1c(-c2ccccc2)c2ccccc2[nH]c1=O