Reaction Details
TargetInsulin-like growth factor 1 receptor
LigandBDBM50375338
Substrate/Competitorn/a
Meas. Tech.ChEMBL_471114 (CHEMBL921267)
IC50 1040±n/a nM
Citation Mulvihill, MJJi, QSCoate, HRCooke, ADong, HFeng, LForeman, KRosenfeld-Franklin, MHonda, AMak, GMulvihill, KMNigro, AIO'Connor, MPirrit, CSteinig, AGSiu, KStolz, KMSun, YTavares, PAYao, YGibson, NW Novel 2-phenylquinolin-7-yl-derived imidazo[1,5-a]pyrazines as potent insulin-like growth factor-I receptor (IGF-IR) inhibitors. Bioorg Med Chem16:1359-75 (2008) 
 
Insulin-like growth factor 1 receptor
Name:Insulin-like growth factor 1 receptor
Type:Protein
Mol. Mass.:154776.79
Organism:Homo sapiens (Human)
Description:P08069
Residue:1367
BDBM50375338
NameBDBM50375338
Synonyms:CHEMBL260888
TypeSmall organic molecule
Emp. Form.C22H17N5
Mol. Mass.351.4039
SMILESCc1nc(-c2ccc3ccc(nc3c2)-c2ccccc2)c2c(N)nccn12