Reaction Details
TargetInsulin-like growth factor 1 receptor
LigandBDBM50340953
Substrate/Competitorn/a
Meas. Tech.ChEMBL_471114 (CHEMBL921267)
IC50>10000±n/a nM
Citation Mulvihill, MJJi, QSCoate, HRCooke, ADong, HFeng, LForeman, KRosenfeld-Franklin, MHonda, AMak, GMulvihill, KMNigro, AIO'Connor, MPirrit, CSteinig, AGSiu, KStolz, KMSun, YTavares, PAYao, YGibson, NW Novel 2-phenylquinolin-7-yl-derived imidazo[1,5-a]pyrazines as potent insulin-like growth factor-I receptor (IGF-IR) inhibitors. Bioorg Med Chem16:1359-75 (2008) 
 
Insulin-like growth factor 1 receptor
Name:Insulin-like growth factor 1 receptor
Type:Protein
Mol. Mass.:154776.79
Organism:Homo sapiens (Human)
Description:P08069
Residue:1367
BDBM50340953
NameBDBM50340953
Synonyms:3-cyclobutyl-1-(quinolin-7-yl)imidazo[1,5-a]pyrazin-8-amine CHEMBL261803
TypeSmall organic molecule
Emp. Form.C19H17N5
Mol. Mass.315.3718
SMILESNc1nccn2c(nc(-c3ccc4cccnc4c3)c12)C1CCC1