Reaction Details
TargetInsulin-like growth factor 1 receptor
LigandBDBM50375339
Substrate/Competitorn/a
Meas. Tech.ChEMBL_471114 (CHEMBL921267)
IC50 18±n/a nM
Citation Mulvihill, MJJi, QSCoate, HRCooke, ADong, HFeng, LForeman, KRosenfeld-Franklin, MHonda, AMak, GMulvihill, KMNigro, AIO'Connor, MPirrit, CSteinig, AGSiu, KStolz, KMSun, YTavares, PAYao, YGibson, NW Novel 2-phenylquinolin-7-yl-derived imidazo[1,5-a]pyrazines as potent insulin-like growth factor-I receptor (IGF-IR) inhibitors. Bioorg Med Chem16:1359-75 (2008) 
 
Insulin-like growth factor 1 receptor
Name:Insulin-like growth factor 1 receptor
Type:Protein
Mol. Mass.:154776.79
Organism:Homo sapiens (Human)
Description:P08069
Residue:1367
BDBM50375339
NameBDBM50375339
Synonyms:CHEMBL258648
TypeSmall organic molecule
Emp. Form.C29H28N6O
Mol. Mass.476.5722
SMILESNc1nccn2c(nc(-c3ccc4ccc(nc4c3)-c3ccccc3)c12)[C@@H]1C[C@@H](C1)N1CCOCC1