Reaction Details
TargetMuscarinic acetylcholine receptor M1
LigandBDBM50296331
Substrate/Competitorn/a
Meas. Tech.ChEMBL_581968 (CHEMBL1058948)
Ki 0.08±n/a nM
Citation Prat, MFernández, DBuil, MACrespo, MICasals, GFerrer, MTort, LCastro, JMonleón, JMGavaldà, AMiralpeix, MRamos, IDoménech, TVilella, DAntón, FHuerta, JMEspinosa, SLópez, MSentellas, SGonzález, MAlbertí, JSegarra, VCárdenas, ABeleta, JRyder, H Discovery of novel quaternary ammonium derivatives of (3R)-quinuclidinol esters as potent and long-acting muscarinic antagonists with potential for minimal systemic exposure after inhaled administration: identification of (3R)-3-{[hydroxy(di-2-thienyl)acetyl]oxy}-1-(3-phenoxypropyl)-1-azoniabicyclo J Med Chem52:5076-92 (2010) 
 
Muscarinic acetylcholine receptor M1
Name:Muscarinic acetylcholine receptor M1
Type:Protein
Mol. Mass.:51442.54
Organism:Homo sapiens (Human)
Description:P11229
Residue:460
BDBM50296331
NameBDBM50296331
Synonyms:(3R)-3-{[Hydroxy(di-2-thienyl)acetyl]oxy}-1-(3-phenoxypropyl)-1-azoniabicyclo[2.2.2]octane bromide Aclidinium Tudorza Pressair US9687478, 44
TypeSmall organic molecule
Emp. Form.C26H30NO4S2
Mol. Mass.484.65
SMILESOC(C(=O)O[C@H]1C[N+]2(CCCOc3ccccc3)CCC1CC2)(c1cccs1)c1cccs1