Reaction Details
TargetMuscarinic acetylcholine receptor M2
LigandBDBM50296317
Substrate/Competitorn/a
Meas. Tech.ChEMBL_581961 (CHEMBL1058941)
IC50 0.26±n/a nM
Citation Prat, MFernández, DBuil, MACrespo, MICasals, GFerrer, MTort, LCastro, JMonleón, JMGavaldà, AMiralpeix, MRamos, IDoménech, TVilella, DAntón, FHuerta, JMEspinosa, SLópez, MSentellas, SGonzález, MAlbertí, JSegarra, VCárdenas, ABeleta, JRyder, H Discovery of novel quaternary ammonium derivatives of (3R)-quinuclidinol esters as potent and long-acting muscarinic antagonists with potential for minimal systemic exposure after inhaled administration: identification of (3R)-3-{[hydroxy(di-2-thienyl)acetyl]oxy}-1-(3-phenoxypropyl)-1-azoniabicyclo J Med Chem52:5076-92 (2010) 
 
Muscarinic acetylcholine receptor M2
Name:Muscarinic acetylcholine receptor M2
Type:GPCR
Mol. Mass.:51730.61
Organism:Homo sapiens (Human)
Description:P08172
Residue:466
BDBM50296317
NameBDBM50296317
Synonyms:(3R)-1-Azabicyclo[2.2.2]oct-3-ylhydroxy(di-2-thienyl)acetate | CHEMBL551729
TypeSmall organic molecule
Emp. Form.C17H19NO3S2
Mol. Mass.349.468
SMILESOC(C(=O)O[C@H]1CN2CCC1CC2)(c1cccs1)c1cccs1