Reaction Details
TargetInhibitor of nuclear factor kappa-B kinase subunit alpha
LigandBDBM50302163
Substrate/Competitorn/a
Meas. Tech.ChEMBL_598913 (CHEMBL1047289)
IC50 90±n/a nM
Citation Wu, JPFleck, RBrickwood, JCapolino, ACatron, KChen, ZCywin, CEmeigh, JFoerst, MGinn, JHrapchak, MHickey, EHao, MHKashem, MLi, JLiu, WMorwick, TNelson, RMarshall, DMartin, LNemoto, PPotocki, ILiuzzi, MPeet, GWScouten, EStefany, DTurner, MWeldon, SZimmitti, CSpero, DKelly, TA The discovery of thienopyridine analogues as potent IkappaB kinase beta inhibitors. Part II. Bioorg Med Chem Lett19:5547-51 (2009) 
 
Inhibitor of nuclear factor kappa-B kinase subunit alpha
Name:Inhibitor of nuclear factor kappa-B kinase subunit alpha
Type:PROTEIN
Mol. Mass.:84642.21
Organism:Homo sapiens (Human)
Description:ChEMBL_327453
Residue:745
BDBM50302163
NameBDBM50302163
Synonyms:3-amino-6-(4-aminopiperidin-1-yl)-4-propylthieno[2,3-b]pyridine-2-carboxamide | CHEMBL578601
TypeSmall organic molecule
Emp. Form.C16H23N5OS
Mol. Mass.333.452
SMILESCCCc1cc(nc2sc(C(N)=O)c(N)c12)N1CCC(N)CC1