Reaction Details
TargetMelanocortin receptor 3
LigandBDBM50315668
Substrate/Competitorn/a
Meas. Tech.ChEMBL_624017 (CHEMBL1116903)
EC50>26700±n/a nM
Citation Lansdell, MIHepworth, DCalabrese, ABrown, ADBlagg, JBurring, DJWilson, PFradet, DBrown, TBQuinton, FMistry, NTang, KMount, NStacey, PEdmunds, NAdams, CGaboardi, SNeal-Morgan, SWayman, CCole, SPhipps, JLewis, MVerrier, HGillon, VFeeder, NHeatherington, ASultana, SHaughie, SMartin, SWSudworth, MTweedy, S Discovery of a selective small-molecule melanocortin-4 receptor agonist with efficacy in a pilot study of sexual dysfunction in humans. J Med Chem53:3183-97 (2010) 
 
Melanocortin receptor 3
Name:Melanocortin receptor 3
Type:Enzyme
Mol. Mass.:36044.86
Organism:Homo sapiens (Human)
Description:P41968
Residue:323
BDBM50315668
NameBDBM50315668
Synonyms:((3R,4S)-4-(2,4-difluorophenyl)-1-(pyrimidin-2-yl)pyrrolidin-3-yl)((3S,4S,5R)-4-hydroxy-3,5-dimethyl-4-phenylpiperidin-1-yl)methanone | CHEMBL1089485
TypeSmall organic molecule
Emp. Form.C28H30F2N4O2
Mol. Mass.492.5602
SMILESC[C@H]1CN(C[C@@H](C)[C@]1(O)c1ccccc1)C(=O)[C@H]1CN(C[C@@H]1c1ccc(F)cc1F)c1ncccn1