Reaction Details
TargetMelanocortin receptor 4
LigandBDBM50315678
Substrate/Competitorn/a
Meas. Tech.ChEMBL_624023 (CHEMBL1116909)
Ki 233±n/a nM
Citation Lansdell, MIHepworth, DCalabrese, ABrown, ADBlagg, JBurring, DJWilson, PFradet, DBrown, TBQuinton, FMistry, NTang, KMount, NStacey, PEdmunds, NAdams, CGaboardi, SNeal-Morgan, SWayman, CCole, SPhipps, JLewis, MVerrier, HGillon, VFeeder, NHeatherington, ASultana, SHaughie, SMartin, SWSudworth, MTweedy, S Discovery of a selective small-molecule melanocortin-4 receptor agonist with efficacy in a pilot study of sexual dysfunction in humans. J Med Chem53:3183-97 (2010) 
 
Melanocortin receptor 4
Name:Melanocortin receptor 4
Type:Enzyme
Mol. Mass.:36949.50
Organism:Homo sapiens (Human)
Description:P32245
Residue:332
BDBM50315678
NameBDBM50315678
Synonyms:((3R,4S)-1-butyl-4-(2,4-difluorophenyl)pyrrolidin-3-yl)((3S,4S,5R)-4-hydroxy-3,5-dimethyl-4-phenylpiperidin-1-yl)methanone | CHEMBL1090484
TypeSmall organic molecule
Emp. Form.C28H36F2N2O2
Mol. Mass.470.5944
SMILESCCCCN1C[C@@H]([C@H](C1)c1ccc(F)cc1F)C(=O)N1C[C@H](C)[C@](O)([C@H](C)C1)c1ccccc1