Reaction Details
TargetNuclear receptor subfamily 4 group A member 1
LigandBDBM50378798
Substrate/Competitorn/a
Meas. Tech.ChEMBL_650684 (CHEMBL1227264)
Kd 1510±n/a nM
Citation Zhan, YDu, XChen, HLiu, JZhao, BHuang, DLi, GXu, QZhang, MWeimer, BCChen, DCheng, ZZhang, LLi, QLi, SZheng, ZSong, SHuang, YYe, ZSu, WLin, SCShen, YWu, Q Cytosporone B is an agonist for nuclear orphan receptor Nur77. Nat Chem Biol4:548-56 (2008) 
 
Nuclear receptor subfamily 4 group A member 1
Name:Nuclear receptor subfamily 4 group A member 1
Type:Enzyme Catalytic Domain
Mol. Mass.:64467.13
Organism:Homo sapiens (Human)
Description:gi_27894344
Residue:598
BDBM50378798
NameBDBM50378798
Synonyms:CYTOSPORONE B
TypeSmall organic molecule
Emp. Form.C18H26O5
Mol. Mass.322.396
SMILESCCCCCCCC(=O)c1c(O)cc(O)cc1CC(=O)OCC