Reaction Details
TargetHydroxycarboxylic acid receptor 3
LigandBDBM50384616
Substrate/Competitorn/a
Meas. Tech.ChEMBL_820674 (CHEMBL2037945)
EC50 190±n/a nM
Citation Palani, ARao, AUChen, XHuang, XSu, JTang, HHuang, YQin, JXiao, DDegrado, SSofolarides, MZhu, XLiu, ZMcKittrick, BZhou, WAslanian, RGreenlee, WJSenior, MCheewatrakoolpong, BZhang, HFarley, CCook, JKurowski, SLi, Qvan Heek, MWang, GHsieh, YLi, FGreenfeder, SChintala, M Discovery of SCH 900271, a Potent Nicotinic Acid Receptor Agonist for the Treatment of Dyslipidemia. ACS Med Chem Lett3:63-68 (2012) 
 
Hydroxycarboxylic acid receptor 3
Name:Hydroxycarboxylic acid receptor 3
Type:Enzyme Catalytic Domain
Mol. Mass.:44498.06
Organism:Homo sapiens (Human)
Description:GPR109B 0 HUMAN::P49019
Residue:387
BDBM50384616
NameBDBM50384616
Synonyms:CHEMBL2036813
TypeSmall organic molecule
Emp. Form.C11H12N2O4
Mol. Mass.236.224
SMILESCCCCc1cc(=O)oc2[nH]c(=O)[nH]c(=O)c12