Reaction Details
TargetHydroxycarboxylic acid receptor 2
LigandBDBM23515
Substrate/Competitorn/a
Meas. Tech.ChEMBL_820676 (CHEMBL2037947)
EC50 29±n/a nM
Citation Palani, ARao, AUChen, XHuang, XSu, JTang, HHuang, YQin, JXiao, DDegrado, SSofolarides, MZhu, XLiu, ZMcKittrick, BZhou, WAslanian, RGreenlee, WJSenior, MCheewatrakoolpong, BZhang, HFarley, CCook, JKurowski, SLi, Qvan Heek, MWang, GHsieh, YLi, FGreenfeder, SChintala, M Discovery of SCH 900271, a Potent Nicotinic Acid Receptor Agonist for the Treatment of Dyslipidemia. ACS Med Chem Lett3:63-68 (2012) 
 
Hydroxycarboxylic acid receptor 2
Name:Hydroxycarboxylic acid receptor 2
Type:PROTEIN
Mol. Mass.:41418.01
Organism:Mus musculus
Description:ChEMBL_820676
Residue:360
BDBM23515
NameBDBM23515
Synonyms:CHEMBL573 Nicotinic Acid pyridine-3-carboxylic acid | wampocap
TypeSmall organic molecule
Emp. Form.C6H5NO2
Mol. Mass.123.1094
SMILESOC(=O)c1cccnc1