Reaction Details
TargetTyrosyl-DNA phosphodiesterase 1
LigandBDBM50388544
Substrate/Competitorn/a
Meas. Tech.ChEMBL_830577 (CHEMBL2061432)
IC50 1520±n/a nM
Citation Nguyen, TXMorrell, AConda-Sheridan, MMarchand, CAgama, KBermingham, ABermingam, AStephen, AGChergui, ANaumova, AFisher, RO'Keefe, BRPommier, YCushman, M Synthesis and biological evaluation of the first dual tyrosyl-DNA phosphodiesterase I (Tdp1)-topoisomerase I (Top1) inhibitors. J Med Chem55:4457-78 (2012) 
 
Tyrosyl-DNA phosphodiesterase 1
Name:Tyrosyl-DNA phosphodiesterase 1
Type:Enzyme
Mol. Mass.:68430.66
Organism:Homo sapiens (Human)
Description:Q9NUW8
Residue:608
BDBM50388544
NameBDBM50388544
Synonyms:CHEMBL2057323
TypeSmall organic molecule
Emp. Form.C41H36N4O4
Mol. Mass.648.7489
SMILESO=C1c2ccccc2-c2c1c1ccccc1c(=O)n2CCCNCCCNCCCn1c2-c3ccccc3C(=O)c2c2ccccc2c1=O