Reaction Details
TargetProtein kinase C eta type
LigandBDBM50391900
Substrate/Competitorn/a
Meas. Tech.ChEMBL_849742 (CHEMBL2150524)
IC50 34±n/a nM
Citation van Eis, MJEvenou, JPFloersheim, PGaul, CCowan-Jacob, SWMonovich, LRummel, GSchuler, WStark, WStrauss, Avon Matt, AVangrevelinghe, EWagner, JSoldermann, N 2,6-Naphthyridines as potent and selective inhibitors of the novel protein kinase C isozymes. Bioorg Med Chem Lett21:7367-72 (2011) 
 
Protein kinase C eta type
Name:Protein kinase C eta type
Type:Enzyme
Mol. Mass.:77844.26
Organism:Homo sapiens (Human)
Description:The recombinant human PKC enzymes were produced using a baculovirus expression system in SF9 cells
Residue:683
BDBM50391900
NameBDBM50391900
Synonyms:CHEMBL2147540
TypeSmall organic molecule
Emp. Form.C16H17N5
Mol. Mass.279.3397
SMILESCN(CCN)c1nc(cc2cnccc12)-c1ccncc1