Reaction Details
TargetProtein kinase C alpha type
LigandBDBM50391909
Substrate/Competitorn/a
Meas. Tech.ChEMBL_849604 (CHEMBL2150055)
IC50>1000±n/a nM
Citation van Eis, MJEvenou, JPFloersheim, PGaul, CCowan-Jacob, SWMonovich, LRummel, GSchuler, WStark, WStrauss, Avon Matt, AVangrevelinghe, EWagner, JSoldermann, N 2,6-Naphthyridines as potent and selective inhibitors of the novel protein kinase C isozymes. Bioorg Med Chem Lett21:7367-72 (2011) 
 
Protein kinase C alpha type
Name:Protein kinase C alpha type
Type:Enzyme
Mol. Mass.:76755.65
Organism:Homo sapiens (Human)
Description:The recombinant human PKC enzymes were produced using a baculovirus expression system in SF9 cells
Residue:672
BDBM50391909
NameBDBM50391909
Synonyms:CHEMBL2147549
TypeSmall organic molecule
Emp. Form.C20H26N6
Mol. Mass.350.4606
SMILESCC(C)Nc1cc(ccn1)-c1cc2cnccc2c(NCC(C)(C)N)n1