Reaction Details
TargetProtein kinase C alpha type
LigandBDBM50324319
Substrate/Competitorn/a
Meas. Tech.ChEMBL_849604 (CHEMBL2150055)
IC50>1000±n/a nM
Citation van Eis, MJEvenou, JPFloersheim, PGaul, CCowan-Jacob, SWMonovich, LRummel, GSchuler, WStark, WStrauss, Avon Matt, AVangrevelinghe, EWagner, JSoldermann, N 2,6-Naphthyridines as potent and selective inhibitors of the novel protein kinase C isozymes. Bioorg Med Chem Lett21:7367-72 (2011) 
 
Protein kinase C alpha type
Name:Protein kinase C alpha type
Type:Enzyme
Mol. Mass.:76755.65
Organism:Homo sapiens (Human)
Description:The recombinant human PKC enzymes were produced using a baculovirus expression system in SF9 cells
Residue:672
BDBM50324319
NameBDBM50324319
Synonyms:1-Piperazin-1-yl-3-pyridin-4-yl[2,6]naphthyridine | CHEMBL1214932
TypeSmall organic molecule
Emp. Form.C17H17N5
Mol. Mass.291.3504
SMILESC1CN(CCN1)c1nc(cc2cnccc12)-c1ccncc1