Reaction Details
TargetProtein kinase C eta type
LigandBDBM50391898
Substrate/Competitorn/a
Meas. Tech.ChEMBL_849742 (CHEMBL2150524)
IC50 9±n/a nM
Citation van Eis, MJEvenou, JPFloersheim, PGaul, CCowan-Jacob, SWMonovich, LRummel, GSchuler, WStark, WStrauss, Avon Matt, AVangrevelinghe, EWagner, JSoldermann, N 2,6-Naphthyridines as potent and selective inhibitors of the novel protein kinase C isozymes. Bioorg Med Chem Lett21:7367-72 (2011) 
 
Protein kinase C eta type
Name:Protein kinase C eta type
Type:Enzyme
Mol. Mass.:77844.26
Organism:Homo sapiens (Human)
Description:The recombinant human PKC enzymes were produced using a baculovirus expression system in SF9 cells
Residue:683
BDBM50391898
NameBDBM50391898
Synonyms:CHEMBL2147538
TypeSmall organic molecule
Emp. Form.C17H19N5
Mol. Mass.293.3663
SMILESCC(C)(N)CNc1nc(cc2cnccc12)-c1ccncc1