Reaction Details
TargetProtein kinase C alpha type
LigandBDBM50391897
Substrate/Competitorn/a
Meas. Tech.ChEMBL_849604 (CHEMBL2150055)
IC50 829±n/a nM
Citation van Eis, MJEvenou, JPFloersheim, PGaul, CCowan-Jacob, SWMonovich, LRummel, GSchuler, WStark, WStrauss, Avon Matt, AVangrevelinghe, EWagner, JSoldermann, N 2,6-Naphthyridines as potent and selective inhibitors of the novel protein kinase C isozymes. Bioorg Med Chem Lett21:7367-72 (2011) 
 
Protein kinase C alpha type
Name:Protein kinase C alpha type
Type:Enzyme
Mol. Mass.:76755.65
Organism:Homo sapiens (Human)
Description:The recombinant human PKC enzymes were produced using a baculovirus expression system in SF9 cells
Residue:672
BDBM50391897
NameBDBM50391897
Synonyms:CHEMBL2147537
TypeSmall organic molecule
Emp. Form.C16H17N5
Mol. Mass.279.3397
SMILESC[C@H](N)CNc1nc(cc2cnccc12)-c1ccncc1