Reaction Details
TargetProtein kinase C beta type
LigandBDBM50391894
Substrate/Competitorn/a
Meas. Tech.ChEMBL_849739 (CHEMBL2150521)
IC50>1000±n/a nM
Citation van Eis, MJEvenou, JPFloersheim, PGaul, CCowan-Jacob, SWMonovich, LRummel, GSchuler, WStark, WStrauss, Avon Matt, AVangrevelinghe, EWagner, JSoldermann, N 2,6-Naphthyridines as potent and selective inhibitors of the novel protein kinase C isozymes. Bioorg Med Chem Lett21:7367-72 (2011) 
 
Protein kinase C beta type
Name:Protein kinase C beta type
Type:Enzyme
Mol. Mass.:76873.67
Organism:Homo sapiens (Human)
Description:The recombinant human PKC enzymes were produced using a baculovirus expression system in SF9 cells
Residue:671
BDBM50391894
NameBDBM50391894
Synonyms:CHEMBL2147534
TypeSmall organic molecule
Emp. Form.C16H16N4
Mol. Mass.264.325
SMILESNCCNc1cc(cc2cnccc12)-c1ccncc1