Reaction Details
TargetProtein kinase C delta type
LigandBDBM50391899
Substrate/Competitorn/a
Meas. Tech.ChEMBL_849740 (CHEMBL2150522)
IC50 932±n/a nM
Citation van Eis, MJEvenou, JPFloersheim, PGaul, CCowan-Jacob, SWMonovich, LRummel, GSchuler, WStark, WStrauss, Avon Matt, AVangrevelinghe, EWagner, JSoldermann, N 2,6-Naphthyridines as potent and selective inhibitors of the novel protein kinase C isozymes. Bioorg Med Chem Lett21:7367-72 (2011) 
 
Protein kinase C delta type
Name:Protein kinase C delta type
Type:Enzyme
Mol. Mass.:77516.79
Organism:Homo sapiens (Human)
Description:The recombinant human PKC enzymes were produced using a baculovirus expression system in SF9 cells
Residue:676
BDBM50391899
NameBDBM50391899
Synonyms:CHEMBL2147539
TypeSmall organic molecule
Emp. Form.C22H21N5
Mol. Mass.355.4356
SMILESNC(CNc1nc(cc2cnccc12)-c1ccncc1)Cc1ccccc1