Reaction Details
TargetProtein kinase C theta type
LigandBDBM50391906
Substrate/Competitorn/a
Meas. Tech.ChEMBL_849743 (CHEMBL2150525)
IC50>1000±n/a nM
Citation van Eis, MJEvenou, JPFloersheim, PGaul, CCowan-Jacob, SWMonovich, LRummel, GSchuler, WStark, WStrauss, Avon Matt, AVangrevelinghe, EWagner, JSoldermann, N 2,6-Naphthyridines as potent and selective inhibitors of the novel protein kinase C isozymes. Bioorg Med Chem Lett21:7367-72 (2011) 
 
Protein kinase C theta type
Name:Protein kinase C theta type
Type:Serine/threonine-protein kinase
Mol. Mass.:81878.04
Organism:Homo sapiens (Human)
Description:Full-length human PKC theta (Panvera Catalog No. P2996).
Residue:706
BDBM50391906
NameBDBM50391906
Synonyms:CHEMBL2147546
TypeSmall organic molecule
Emp. Form.C17H15N5O
Mol. Mass.305.3339
SMILESO=C1CN(CCN1)c1nc(cc2cnccc12)-c1ccncc1