Reaction Details
TargetTissue-type plasminogen activator
LigandBDBM50392592
Substrate/Competitorn/a
Meas. Tech.ChEMBL_854020 (CHEMBL2155317)
Ki>20000±n/a nM
Citation Pandya, VJain, MChakrabarti, GSoni, HParmar, BChaugule, BPatel, JJarag, TJoshi, JJoshi, NRath, AUnadkat, VSharma, BAjani, HKumar, JSairam, KVPatel, HPatel, P Synthesis and structure-activity relationship of potent, selective and orally active anthranilamide-based factor Xa inhibitors: application of weakly basic sulfoximine group as novel S4 binding element. Eur J Med Chem58:136-52 (2012) 
 
Tissue-type plasminogen activator
Name:Tissue-type plasminogen activator
Type:Enzyme
Mol. Mass.:62931.08
Organism:Homo sapiens (Human)
Description:n/a
Residue:562
BDBM50392592
NameBDBM50392592
Synonyms:CHEMBL2153381
TypeSmall organic molecule
Emp. Form.C26H27Cl2N5O4S
Mol. Mass.576.495
SMILESCCN(CC)CC(=O)NS(=C)(=O)c1ccc(cc1)C(=O)Nc1ccc(Cl)cc1C(=O)Nc1ccc(Cl)cn1