Reaction Details
TargetStearoyl-CoA desaturase
LigandBDBM50362592
Substrate/Competitorn/a
Meas. Tech.ChEMBL_852945 (CHEMBL2154129)
IC50 1±n/a nM
Citation Oballa, RMBelair, LBlack, WCBleasby, KChan, CCDesroches, CDu, XGordon, RGuay, JGuiral, SHafey, MJHamelin, EHuang, ZKennedy, BLachance, NLandry, FLi, CSMancini, JNormandin, DPocai, APowell, DARamtohul, YKSkorey, KSørensen, DSturkenboom, WStyhler, AWaddleton, DMWang, HWong, SXu, LZhang, L Development of a liver-targeted stearoyl-CoA desaturase (SCD) inhibitor (MK-8245) to establish a therapeutic window for the treatment of diabetes and dyslipidemia. J Med Chem54:5082-96 (2011) 
 
Stearoyl-CoA desaturase
Name:Stearoyl-CoA desaturase
Type:Enzyme
Mol. Mass.:41537.27
Organism:Homo sapiens (Human)
Description:O00767
Residue:359
BDBM50362592
NameBDBM50362592
Synonyms:CHEMBL1938870
TypeSmall organic molecule
Emp. Form.C17H16BrFN6O4
Mol. Mass.467.249
SMILESOC(=O)Cn1nnc(n1)-c1cc(no1)N1CCC(CC1)Oc1cc(F)ccc1Br