Reaction Details
TargetMacrophage colony-stimulating factor 1 receptor
LigandBDBM50377072
Substrate/Competitorn/a
Meas. Tech.ChEMBL_857181 (CHEMBL2163155)
IC50 0.3±n/a nM
Citation Illig, CRManthey, CLWall, MJMeegalla, SKChen, JWilson, KJBallentine, SKDesjarlais, RLSchubert, CCrysler, CSChen, YMolloy, CJChaikin, MADonatelli, RRYurkow, EZhou, ZPlayer, MRTomczuk, BE Optimization of a potent class of arylamide colony-stimulating factor-1 receptor inhibitors leading to anti-inflammatory clinical candidate 4-cyano-N-[2-(1-cyclohexen-1-yl)-4-[1-[(dimethylamino)acetyl]-4-piperidinyl]phenyl]-1H-imidazole-2-carboxamide (JNJ-28312141). J Med Chem54:7860-83 (2011) 
 
Macrophage colony-stimulating factor 1 receptor
Name:Macrophage colony-stimulating factor 1 receptor
Type:Protein
Mol. Mass.:107979.48
Organism:Homo sapiens (Human)
Description:P07333
Residue:972
BDBM50377072
NameBDBM50377072
Synonyms:CHEMBL438533
TypeSmall organic molecule
Emp. Form.C23H28N4O2
Mol. Mass.392.494
SMILESCC1CCN(CC1)c1cc(ccc1NC(=O)c1ccc(o1)C#N)C1CCNCC1