Reaction Details
TargetLysine-specific demethylase 5C
LigandBDBM50395082
Substrate/Competitorn/a
Meas. Tech.ChEMBL_859440 (CHEMBL2167518)
IC50>100000±n/a nM
Citation Rose, NRWoon, ECTumber, AWalport, LJChowdhury, RLi, XSKing, ONLejeune, CNg, SSKrojer, TChan, MCRydzik, AMHopkinson, RJChe, KHDaniel, MStrain-Damerell, CGileadi, CKochan, GLeung, IKDunford, JYeoh, KKRatcliffe, PJBurgess-Brown, Nvon Delft, FMuller, SMarsden, BBrennan, PEMcDonough, MAOppermann, UKlose, RJSchofield, CJKawamura, A Plant growth regulator daminozide is a selective inhibitor of human KDM2/7 histone demethylases. J Med Chem55:6639-43 (2012) 
 
Lysine-specific demethylase 5C
Name:Lysine-specific demethylase 5C
Type:PROTEIN
Mol. Mass.:175691.17
Organism:Homo sapiens (Human)
Description:P41229
Residue:1560
BDBM50395082
NameBDBM50395082
Synonyms:CHEMBL2164247
TypeSmall organic molecule
Emp. Form.C7H14N2O3
Mol. Mass.174.1977
SMILESCN(C)N(C)C(=O)CCC(O)=O