Reaction Details
TargetBombesin receptor subtype-3
LigandBDBM50400247
Substrate/Competitorn/a
Meas. Tech.ChEMBL_872481 (CHEMBL2182521)
IC50 0.7±n/a nM
Citation Liu, PLanza, TJChioda, MJones, CChobanian, HRGuo, YChang, LKelly, TMKan, YPalyha, OGuan, XMMarsh, DJMetzger, JMRamsay, KWang, SPStrack, AMMiller, RPang, JLyons, KDragovic, JNing, JGSchafer, WAWelch, CJGong, XGao, YDHornak, VBall, RGTsou, NReitman, MLWyvratt, MJNargund, RPLin, LS Discovery of benzodiazepine sulfonamide-based bombesin receptor subtype 3 agonists and their unusual chirality. ACS Med Chem Lett2:933-937 (2011) 
 
Bombesin receptor subtype-3
Name:Bombesin receptor subtype-3
Type:Enzyme Catalytic Domain
Mol. Mass.:44424.45
Organism:Homo sapiens (Human)
Description:Bombesin 3 BRS3 HUMAN::P32247
Residue:399
BDBM50400247
NameBDBM50400247
Synonyms:CHEMBL2179918
TypeSmall organic molecule
Emp. Form.C26H23F3N4O2S
Mol. Mass.512.547
SMILESCC(C)(C)c1ccc(cc1)S(=O)(=O)N1Cc2ccc(nc2Nc2ccc3ncccc3c12)C(F)(F)F