Reaction Details
TargetHistone-lysine N-methyltransferase 2B
LigandBDBM50400778
Substrate/Competitorn/a
Meas. Tech.ChEMBL_879140 (CHEMBL2209111)
IC50>100000±n/a nM
Citation Verma, SKTian, XLaFrance, LVDuquenne, CSuarez, DPNewlander, KARomeril, SPBurgess, JLGrant, SWBrackley, JAGraves, APScherzer, DAShu, AThompson, COtt, HMAller, GSMachutta, CADiaz, EJiang, YJohnson, NWKnight, SDKruger, RGMcCabe, MTDhanak, DTummino, PJCreasy, CLMiller, WH Identification of Potent, Selective, Cell-Active Inhibitors of the Histone Lysine Methyltransferase EZH2. ACS Med Chem Lett3:1091-1096 (2012) 
 
Histone-lysine N-methyltransferase 2B
Name:Histone-lysine N-methyltransferase 2B
Type:PROTEIN
Mol. Mass.:293570.50
Organism:Homo sapiens (Human)
Description:ChEMBL_879140
Residue:2715
BDBM50400778
NameBDBM50400778
Synonyms:CHEMBL2204995
TypeSmall organic molecule
Emp. Form.C31H39N7O2
Mol. Mass.541.6871
SMILESCCCc1cc(C)[nH]c(=O)c1CNC(=O)c1cc(cc2n(ncc12)C(C)C)-c1ccnc(c1)N1CCN(C)CC1