Reaction Details
TargetHistidine-rich protein PFHRP-II
LigandBDBM22985
Substrate/Competitorn/a
Meas. Tech.ChEMBL_468750 (CHEMBL929932)
IC50 5900000±n/a nM
Citation Gnoatto, SCSusplugas, SDalla Vechia, LFerreira, TBDassonville-Klimpt, AZimmer, KRDemailly, CDa Nascimento, SGuillon, JGrellier, PVerli, HGosmann, GSonnet, P Pharmacomodulation on the 3-acetylursolic acid skeleton: Design, synthesis, and biological evaluation of novel N-{3-[4-(3-aminopropyl)piperazinyl]propyl}-3-O-acetylursolamide derivatives as antimalarial agents. Bioorg Med Chem16:771-82 (2008) 
 
Histidine-rich protein PFHRP-II
Name:Histidine-rich protein PFHRP-II
Type:PROTEIN
Mol. Mass.:35156.49
Organism:Plasmodium falciparum
Description:ChEMBL_500704
Residue:332
BDBM22985
NameBDBM22985
Synonyms:Aralen CHLOROQUINE PHOSPHATE Chloroquine med.21724, Compound 8 | {4-[(7-chloroquinolin-4-yl)amino]pentyl}diethylamine
TypeAntimalarial
Emp. Form.C18H26ClN3
Mol. Mass.319.872
SMILESCCN(CC)CCCC(C)Nc1ccnc2cc(Cl)ccc12