Reaction Details
TargetMuscarinic acetylcholine receptor M2
LigandBDBM50412344
Substrate/Competitorn/a
Meas. Tech.ChEMBL_510506 (CHEMBL995214)
IC50 125.89±n/a nM
Citation Jin, JWang, YShi, DWang, FDavis, RSJin, QFu, WFoley, JJWebb, EFDehaas, CJBerlanga, MBurman, MSarau, HMMorrow, DMRao, PKallal, LAMoore, MLRivero, RAPalovich, MSalmon, MBelmonte, KEBusch-Petersen, J Discovery of novel and long acting muscarinic acetylcholine receptor antagonists. J Med Chem51:4866-9 (2008) 
 
Muscarinic acetylcholine receptor M2
Name:Muscarinic acetylcholine receptor M2
Type:GPCR
Mol. Mass.:51730.61
Organism:Homo sapiens (Human)
Description:P08172
Residue:466
BDBM50412344
NameBDBM50412344
Synonyms:CHEMBL526009
TypeSmall organic molecule
Emp. Form.C30H34N4O6
Mol. Mass.546.6142
SMILESCCOC(=O)c1ccc(NC(=O)N[C@@H](Cc2ccc(O)cc2)C(=O)N[C@H]2CCN(Cc3ccc(O)cc3)C2)cc1