Reaction Details
TargetMuscarinic acetylcholine receptor M3
LigandBDBM50412340
Substrate/Competitorn/a
Meas. Tech.ChEMBL_510512 (CHEMBL996048)
Ki 31.62±n/a nM
Citation Jin, JWang, YShi, DWang, FDavis, RSJin, QFu, WFoley, JJWebb, EFDehaas, CJBerlanga, MBurman, MSarau, HMMorrow, DMRao, PKallal, LAMoore, MLRivero, RAPalovich, MSalmon, MBelmonte, KEBusch-Petersen, J Discovery of novel and long acting muscarinic acetylcholine receptor antagonists. J Med Chem51:4866-9 (2008) 
 
Muscarinic acetylcholine receptor M3
Name:Muscarinic acetylcholine receptor M3
Type:Enzyme
Mol. Mass.:66151.03
Organism:Homo sapiens (Human)
Description:P20309
Residue:590
BDBM50412340
NameBDBM50412340
Synonyms:CHEMBL540359
TypeSmall organic molecule
Emp. Form.C33H41N4O6
Mol. Mass.589.7013
SMILESCC(C)OC(=O)c1ccc(NC(=O)N[C@@H](Cc2ccc(O)cc2)C(=O)N[C@H]2CCC[N+](C)(Cc3cccc(O)c3)C2)cc1