Reaction Details
TargetCytochrome P450 2C19
LigandBDBM50412340
Substrate/Competitorn/a
Meas. Tech.ChEMBL_510522 (CHEMBL996058)
IC50>10000±n/a nM
Citation Jin, JWang, YShi, DWang, FDavis, RSJin, QFu, WFoley, JJWebb, EFDehaas, CJBerlanga, MBurman, MSarau, HMMorrow, DMRao, PKallal, LAMoore, MLRivero, RAPalovich, MSalmon, MBelmonte, KEBusch-Petersen, J Discovery of novel and long acting muscarinic acetylcholine receptor antagonists. J Med Chem51:4866-9 (2008) 
 
Cytochrome P450 2C19
Name:Cytochrome P450 2C19
Type:Enzyme
Mol. Mass.:55935.47
Organism:Homo sapiens (Human)
Description:P33261
Residue:490
BDBM50412340
NameBDBM50412340
Synonyms:CHEMBL540359
TypeSmall organic molecule
Emp. Form.C33H41N4O6
Mol. Mass.589.7013
SMILESCC(C)OC(=O)c1ccc(NC(=O)N[C@@H](Cc2ccc(O)cc2)C(=O)N[C@H]2CCC[N+](C)(Cc3cccc(O)c3)C2)cc1