Reaction Details
TargetC-C chemokine receptor type 5
LigandBDBM50412741
Substrate/Competitorn/a
Meas. Tech.ChEMBL_539133 (CHEMBL1023810)
IC50 19.95±n/a nM
Citation Kazmierski, WMAquino, CChauder, BADeanda, FFerris, RJones-Hertzog, DKKenakin, TKoble, CSWatson, CWheelan, PYang, HYoungman, M Discovery of bioavailable 4,4-disubstituted piperidines as potent ligands of the chemokine receptor 5 and inhibitors of the human immunodeficiency virus-1. J Med Chem51:6538-46 (2008) 
 
C-C chemokine receptor type 5
Name:C-C chemokine receptor type 5
Type:Enzyme
Mol. Mass.:40540.21
Organism:Homo sapiens (Human)
Description:P51681
Residue:352
BDBM50412741
NameBDBM50412741
Synonyms:CHEMBL442933
TypeSmall organic molecule
Emp. Form.C34H44N4O
Mol. Mass.524.7394
SMILESCc1nc2ccccc2n1C1C[C@H]2CC[C@H](C1)N2CCC1(CCN(CC1)C(=O)C1CCCC1)c1ccccc1