Reaction Details
TargetC-C chemokine receptor type 8
LigandBDBM50423249
Substrate/Competitorn/a
Meas. Tech.ChEMBL_454278 (CHEMBL903462)
IC50 3162±n/a nM
Citation Jin, JWang, YWang, FKerns, JKVinader, VMHancock, APLindon, MJStevenson, GIMorrow, DMRao, PNguyen, CBarrett, VJBrowning, CHartmann, GAndrew, DPSarau, HMFoley, JJJurewicz, AJFornwald, JAHarker, AJMoore, MLRivero, RABelmonte, KEConnor, HE Oxazolidinones as novel human CCR8 antagonists. Bioorg Med Chem Lett17:1722-5 (2007) 
 
C-C chemokine receptor type 8
Name:C-C chemokine receptor type 8
Type:PROTEIN
Mol. Mass.:40855.53
Organism:Homo sapiens (Human)
Description:ChEMBL_454278
Residue:355
BDBM50423249
NameBDBM50423249
Synonyms:CHEMBL396102
TypeSmall organic molecule
Emp. Form.C28H30N4O3
Mol. Mass.470.5628
SMILESCOc1ccc2nccc(C3CN(C4CCN(Cc5cc6ccccc6n5C)CC4)C(=O)O3)c2c1