Reaction Details
TargetC-C chemokine receptor type 8
LigandBDBM50423246
Substrate/Competitorn/a
Meas. Tech.ChEMBL_454278 (CHEMBL903462)
IC50 20±n/a nM
Citation Jin, JWang, YWang, FKerns, JKVinader, VMHancock, APLindon, MJStevenson, GIMorrow, DMRao, PNguyen, CBarrett, VJBrowning, CHartmann, GAndrew, DPSarau, HMFoley, JJJurewicz, AJFornwald, JAHarker, AJMoore, MLRivero, RABelmonte, KEConnor, HE Oxazolidinones as novel human CCR8 antagonists. Bioorg Med Chem Lett17:1722-5 (2007) 
 
C-C chemokine receptor type 8
Name:C-C chemokine receptor type 8
Type:PROTEIN
Mol. Mass.:40855.53
Organism:Homo sapiens (Human)
Description:ChEMBL_454278
Residue:355
BDBM50423246
NameBDBM50423246
Synonyms:CHEMBL245568 | SB-649701
TypeSmall organic molecule
Emp. Form.C27H28N4O3
Mol. Mass.456.5362
SMILESCOc1ccc2nccc([C@@H]3CN(C4CCN(Cc5cc6ccccc6[nH]5)CC4)C(=O)O3)c2c1