Reaction Details
TargetPeroxisome proliferator-activated receptor gamma
LigandBDBM28681
Substrate/Competitorn/a
Meas. Tech.ChEMBL_934958 (CHEMBL2320327)
EC50 39±n/a nM
Citation Laghezza, APochetti, GLavecchia, AFracchiolla, GFaliti, SPiemontese, LDi Giovanni, CIacobazzi, VInfantino, VMontanari, RCapelli, DTortorella, PLoiodice, F New 2-(aryloxy)-3-phenylpropanoic acids as peroxisome proliferator-activated receptora/¿ dual agonists able to upregulate mitochondrial carnitine shuttle system gene expression. J Med Chem56:60-72 (2013) 
 
Peroxisome proliferator-activated receptor gamma
Name:Peroxisome proliferator-activated receptor gamma
Type:Nuclear Receptor
Mol. Mass.:57613.46
Organism:Homo sapiens (Human)
Description:P37231
Residue:505
BDBM28681
NameBDBM28681
Synonyms:5-[(4-{2-[methyl(pyridin-2-yl)amino]ethoxy}phenyl)methyl]-1,3-thiazolidine-2,4-dione BRL 49653 CHEMBL121 [3H]rosiglitazone rosiglitazone
Typeradiolabeled ligand
Emp. Form.C18H19N3O3S
Mol. Mass.357.427
SMILESCN(CCOc1ccc(Cc2sc(=O)[nH]c2O)cc1)c1ccccn1