Reaction Details
TargetTyrosyl-DNA phosphodiesterase 1
LigandBDBM50425045
Substrate/Competitorn/a
Meas. Tech.ChEMBL_936620 (CHEMBL2319019)
IC50 5000±n/a nM
Citation Conda-Sheridan, MReddy, PVMorrell, ACobb, BTMarchand, CAgama, KChergui, ARenaud, AStephen, AGBindu, LKPommier, YCushman, M Synthesis and biological evaluation of indenoisoquinolines that inhibit both tyrosyl-DNA phosphodiesterase I (Tdp1) and topoisomerase I (Top1). J Med Chem56:182-200 (2013) 
 
Tyrosyl-DNA phosphodiesterase 1
Name:Tyrosyl-DNA phosphodiesterase 1
Type:Enzyme
Mol. Mass.:68430.66
Organism:Homo sapiens (Human)
Description:Q9NUW8
Residue:608
BDBM50425045
NameBDBM50425045
Synonyms:CHEMBL2312896 US9402842, 43
TypeSmall organic molecule
Emp. Form.C21H19N3O4
Mol. Mass.377.3933
SMILESNCCCn1c2-c3ccccc3C(=O)c2c2ccc(NCC(O)=O)cc2c1=O